Target
Melanocortin receptor 4
Ligand
BDBM135733
Substrate
Meas. Tech.
Competitive Inhibition Assay
Ki
145±n/a nM
Citation
 Shi, YSharma, SDDodd, JHYang, WChen, X Melanocortin receptor-specific peptides US Patent  US10632171 Publication Date 4/28/2020 
Target
Name:
Melanocortin receptor 4
Synonyms:
MC4-R MC4R_HUMAN Melanocortin receptor 4 (MC-4) Melanocortin receptor 4 (MC4R)
Type:
Enzyme
Mol. Mass.:
36949.50
Organism:
Homo sapiens (Human)
Description:
P32245
Residue:
332
  
Inhibitor
Name:
BDBM135733
Synonyms:
US10179804, Example 118 US8846601, 118 | US9458201, 118
Type:
Small organic molecule
Emp. Form.:
C52H76N18O10
Mol. Mass.:
1113.2744
SMILES:
CC(=O)N[C@@H](CCCNC(N)=N)C(=O)N[C@H]1CC(=O)NCCCC[C@H](NC(=O)[C@H](Cc2c[nH]c3ccccc23)NC(=O)[C@H](CCCNC(N)=N)NC(=O)[C@@H](Cc2ccccc2)NC(=O)[C@H](CNC(=O)[C@H]2CCNC2)NC1=O)C(N)=O
: