Target
Melanocortin receptor 4
Ligand
BDBM135775
Substrate
Meas. Tech.
Competitive Inhibition Assay
Ki
8.00±n/a nM
Citation
 Shi, YSharma, SDDodd, JHYang, WChen, X Melanocortin receptor-specific peptides US Patent  US10632171 Publication Date 4/28/2020 
Target
Name:
Melanocortin receptor 4
Synonyms:
MC4-R MC4R_HUMAN Melanocortin receptor 4 (MC-4) Melanocortin receptor 4 (MC4R)
Type:
Enzyme
Mol. Mass.:
36949.50
Organism:
Homo sapiens (Human)
Description:
P32245
Residue:
332
  
Inhibitor
Name:
BDBM135775
Synonyms:
US10179804, Example 160 US8846601, 160 | US9458201, 160
Type:
Small organic molecule
Emp. Form.:
C48H69N17O10
Mol. Mass.:
1044.1694
SMILES:
CC(=O)N[C@@H](CCCNC(N)=N)C(=O)N[C@H]1CCCC(=O)NCC[C@H](NC(=O)[C@H](Cc2c[nH]c3ccccc23)NC(=O)[C@H](CCCNC(N)=N)NC(=O)[C@@H](Cc2ccccc2)NC(=O)[C@H](CC(N)=O)NC1=O)C(N)=O
: