Target
Plasma kallikrein
Ligand
BDBM439407
Substrate
Meas. Tech.
Activity Assay
Ki
25.1±n/a nM
Citation
 Kotian, PLBabu, YSWu, MChintareddy, VRKumar, VSZhang, W Human plasma kallikrein inhibitors US Patent  US10633345 Publication Date 4/28/2020 
Target
Name:
Plasma kallikrein
Synonyms:
Fletcher factor KLKB1 Kallikrein Plasma kallikrein heavy chain Plasma prekallikrein
Type:
Protein
Mol. Mass.:
71391.16
Organism:
Homo sapiens (Human)
Description:
P03952
Residue:
638
  
Inhibitor
Name:
BDBM439407
Synonyms:
US10633345, Compound 52h US10633345, Compound 71b US11203574, Compound 71a | US11230530, Compound 71b
Type:
Small organic molecule
Emp. Form.:
C30H26F4N6O
Mol. Mass.:
562.5607
SMILES:
CN(C(c1ccc(cc1)C#N)c1ccc(F)c(NC(=O)c2cc(nn2-c2cccc(CN)c2)C(F)(F)F)c1)C1CC1
: