Target
Hexokinase-4
Ligand
BDBM439303
Substrate
Meas. Tech.
In Vitro Activity Assay
IC50
17.0±n/a nM
Citation
 Treon, SPBuhrlage, SJGray, NSTan, LYang, G Methods to treat lymphoplasmacytic lymphoma US Patent  US10633348 Publication Date 4/28/2020 
Target
Name:
Hexokinase-4
Synonyms:
GCK Glucokinase (GK) HK IV HXK4_HUMAN Hexokinase-D
Type:
Enzyme
Mol. Mass.:
52175.81
Organism:
Homo sapiens (Human)
Description:
P35557
Residue:
465
  
Inhibitor
Name:
BDBM439303
Synonyms:
US10633348, Compound (A-17)
Type:
Small organic molecule
Emp. Form.:
C29H31F3N6O3
Mol. Mass.:
568.59
SMILES:
CCN1CCN(Cc2ccc(NC(=O)c3ccc(C)c(Oc4cc(NC(=O)C=C)ncn4)c3)cc2C(F)(F)F)CC1
: