Target
Tyrosine-protein kinase HCK
Ligand
BDBM439308
Substrate
Meas. Tech.
In Vitro Activity Assay
IC50
38.4±n/a nM
Citation
 Treon, SPBuhrlage, SJGray, NSTan, LYang, G Methods to treat lymphoplasmacytic lymphoma US Patent  US10633348 Publication Date 4/28/2020 
Target
Name:
Tyrosine-protein kinase HCK
Synonyms:
HCK Hematopoietic cell kinase p59-HCK/p60-HCK p61Hck
Type:
Enzyme Catalytic Domain
Mol. Mass.:
59600.18
Organism:
Homo sapiens (Human)
Description:
P08631
Residue:
526
  
Inhibitor
Name:
BDBM439308
Synonyms:
US10633348, Compound (A-6)
Type:
Small organic molecule
Emp. Form.:
C29H31F3N8O2
Mol. Mass.:
580.604
SMILES:
CCN1CCN(Cc2ccc(NC(=O)c3ccc(C)c(Oc4cc(Nc5ccn[nH]5)ncn4)c3)cc2C(F)(F)F)CC1
: