Target
Vascular endothelial growth factor receptor 2
Ligand
BDBM365008
Substrate
Meas. Tech.
Kinase Assay
IC50
118±n/a nM
Citation
 Boral, SMalone, TCWang, S Pyridyl benzothiophenes as kinase inhibitors US Patent  US10633373 Publication Date 4/28/2020 
Target
Name:
Vascular endothelial growth factor receptor 2
Synonyms:
CD_antigen=CD309 Fetal liver kinase 1 (FLK-1) KDR Protein-tyrosine kinase receptor Flk-1 VEGFR-2 VEGFR2 Vascular Endothelial Growth Factor Receptor Kinase 2 Vascular endothelial growth factor receptor 2 (KDR) Vascular endothelial growth factor receptor 2 (VEGFR2) Vascular endothelial growth factor receptor-2 (VEGFR-2)
Type:
Receptor Tyrosine Kinase
Mol. Mass.:
151510.97
Organism:
Homo sapiens (Human)
Description:
P35968
Residue:
1356
  
Inhibitor
Name:
BDBM365008
Synonyms:
US10633373, Example 21 US9868726, Example 21 | methyl 4-[({6-amino-5-[5-({[(3- methylphenyl)amino]carbonyl} amino)-1-benzothien-2- yl]pyridin-3- yl}carbonyl)amino]butanoate
Type:
Small organic molecule
Emp. Form.:
C27H27N5O4S
Mol. Mass.:
517.599
SMILES:
COC(=O)CCCNC(=O)c1cnc(N)c(c1)-c1cc2cc(NC(=O)Nc3cccc(C)c3)ccc2s1
: