Target
Platelet-derived growth factor receptor beta
Ligand
BDBM365312
Substrate
Meas. Tech.
Kinase Assay
IC50
42.0±n/a nM
Citation
 Boral, SMalone, TCWang, S Pyridyl benzothiophenes as kinase inhibitors US Patent  US10633373 Publication Date 4/28/2020 
Target
Name:
Platelet-derived growth factor receptor beta
Synonyms:
Beta-type platelet-derived growth factor receptor CD140b antigen PDGF Receptor Substrate PDGFR PDGFR-1 PDGFRB PGFRB_HUMAN Platelet-derived growth factor receptor 1 Platelet-derived growth factor receptor beta (PDGFR-beta) Platelet-derived growth factor receptor beta (PDGFRbeta) | VHL/PDGFRB
Type:
Enzyme
Mol. Mass.:
123922.25
Organism:
Homo sapiens (Human)
Description:
P09619
Residue:
1106
  
Inhibitor
Name:
BDBM365312
Synonyms:
US10633373, Example 31 US9868726, Example 31 | {6-amino-5-[5-({[(3- methylphenyl)amino]carbonyl} amino)-1-benzothien-2- yl]pyridin-3-yl}boronic acid
Type:
Small organic molecule
Emp. Form.:
C21H19BN4O3S
Mol. Mass.:
418.277
SMILES:
Cc1cccc(NC(=O)Nc2ccc3sc(cc3c2)-c2cc(cnc2N)B(O)O)c1
: