Target
Vascular endothelial growth factor receptor 2
Ligand
BDBM365318
Substrate
Meas. Tech.
Kinase Assay
IC50
50.0±n/a nM
Citation
 Boral, SMalone, TCWang, S Pyridyl benzothiophenes as kinase inhibitors US Patent  US10633373 Publication Date 4/28/2020 
Target
Name:
Vascular endothelial growth factor receptor 2
Synonyms:
CD_antigen=CD309 Fetal liver kinase 1 (FLK-1) KDR Protein-tyrosine kinase receptor Flk-1 VEGFR-2 VEGFR2 Vascular Endothelial Growth Factor Receptor Kinase 2 Vascular endothelial growth factor receptor 2 (KDR) Vascular endothelial growth factor receptor 2 (VEGFR2) Vascular endothelial growth factor receptor-2 (VEGFR-2)
Type:
Receptor Tyrosine Kinase
Mol. Mass.:
151510.97
Organism:
Homo sapiens (Human)
Description:
P35968
Residue:
1356
  
Inhibitor
Name:
BDBM365318
Synonyms:
6-amino-N-[dimethyl(oxido)- lambda4-sulfanylidene]-5-{5-[(2- fluoro-5- methylbenzoyl)amino]-1- benzothien-2-yl}nicotinamide US10669265, Example 35 | US9868726, Example 35
Type:
Small organic molecule
Emp. Form.:
C24H21FN4O3S2
Mol. Mass.:
496.577
SMILES:
Cc1ccc(F)c(c1)C(=O)Nc1ccc2sc(cc2c1)-c1cc(cnc1N)C(=O)N=S(C)(C)=O
: