Target
Platelet-derived growth factor receptor beta
Ligand
BDBM365318
Substrate
Meas. Tech.
Kinase Assay
IC50
258±n/a nM
Citation
 Boral, SMalone, TCWang, S Pyridyl benzothiophenes as kinase inhibitors US Patent  US10633373 Publication Date 4/28/2020 
Target
Name:
Platelet-derived growth factor receptor beta
Synonyms:
Beta-type platelet-derived growth factor receptor CD140b antigen PDGF Receptor Substrate PDGFR PDGFR-1 PDGFRB PGFRB_HUMAN Platelet-derived growth factor receptor 1 Platelet-derived growth factor receptor beta (PDGFR-beta) Platelet-derived growth factor receptor beta (PDGFRbeta) | VHL/PDGFRB
Type:
Enzyme
Mol. Mass.:
123922.25
Organism:
Homo sapiens (Human)
Description:
P09619
Residue:
1106
  
Inhibitor
Name:
BDBM365318
Synonyms:
6-amino-N-[dimethyl(oxido)- lambda4-sulfanylidene]-5-{5-[(2- fluoro-5- methylbenzoyl)amino]-1- benzothien-2-yl}nicotinamide US10669265, Example 35 | US9868726, Example 35
Type:
Small organic molecule
Emp. Form.:
C24H21FN4O3S2
Mol. Mass.:
496.577
SMILES:
Cc1ccc(F)c(c1)C(=O)Nc1ccc2sc(cc2c1)-c1cc(cnc1N)C(=O)N=S(C)(C)=O
: