Target
Platelet-derived growth factor receptor beta
Ligand
BDBM365354
Substrate
Meas. Tech.
Kinase Assay
IC50
100.0±n/a nM
Citation
 Boral, SMalone, TCWang, S Pyridyl benzothiophenes as kinase inhibitors US Patent  US10633373 Publication Date 4/28/2020 
Target
Name:
Platelet-derived growth factor receptor beta
Synonyms:
Beta-type platelet-derived growth factor receptor CD140b antigen PDGF Receptor Substrate PDGFR PDGFR-1 PDGFRB PGFRB_HUMAN Platelet-derived growth factor receptor 1 Platelet-derived growth factor receptor beta (PDGFR-beta) Platelet-derived growth factor receptor beta (PDGFRbeta) | VHL/PDGFRB
Type:
Enzyme
Mol. Mass.:
123922.25
Organism:
Homo sapiens (Human)
Description:
P09619
Residue:
1106
  
Inhibitor
Name:
BDBM365354
Synonyms:
6-amino-N-[dimethyl(oxido)- lambda4-sulfanylidene]-5-[4-({[(2- fluoro-5-methylphenyl) amino]carbonyl}amino)phenyl] nicotinamide US10669265, Example 59 | US9868726, Example 59
Type:
Small organic molecule
Emp. Form.:
C26H30FN5O5S
Mol. Mass.:
543.61
SMILES:
Cc1ccc(F)c(NC(=O)Nc2ccc(cc2)-c2cc(cnc2N)C(=O)N=S(=O)(CCCO)CCCO)c1
: