Target
Platelet-derived growth factor receptor beta
Ligand
BDBM365357
Substrate
Meas. Tech.
Kinase Assay
IC50
24.0±n/a nM
Citation
 Boral, SMalone, TCWang, S Pyridyl benzothiophenes as kinase inhibitors US Patent  US10633373 Publication Date 4/28/2020 
Target
Name:
Platelet-derived growth factor receptor beta
Synonyms:
Beta-type platelet-derived growth factor receptor CD140b antigen PDGF Receptor Substrate PDGFR PDGFR-1 PDGFRB PGFRB_HUMAN Platelet-derived growth factor receptor 1 Platelet-derived growth factor receptor beta (PDGFR-beta) Platelet-derived growth factor receptor beta (PDGFRbeta) | VHL/PDGFRB
Type:
Enzyme
Mol. Mass.:
123922.25
Organism:
Homo sapiens (Human)
Description:
P09619
Residue:
1106
  
Inhibitor
Name:
BDBM365357
Synonyms:
1-{4-[2-amino-5-(4,4,5,5- tetramethyl-1,3,2- dioxaborolan-2-yl)pyridin-3- yl]phenyl}-3-(2-fluoro-5- methylphenyl)urea US10669265, Example 62 | US9868726, Example 62
Type:
Small organic molecule
Emp. Form.:
C25H28BFN4O3
Mol. Mass.:
462.324
SMILES:
Cc1ccc(F)c(NC(=O)Nc2ccc(cc2)-c2cc(cnc2N)B2OC(C)(C)C(C)(C)O2)c1
: