Target
Coagulation factor XI
Ligand
BDBM439354
Substrate
Meas. Tech.
Biological Assay
IC50
40.0±n/a nM
Citation
 Yang, FWang, WLi, XChen, GHe, FTao, W Oxopicolinamide derivative, preparation method therefor and pharmaceutical use thereof US Patent  US10633375 Publication Date 4/28/2020 
Target
Name:
Coagulation factor XI
Synonyms:
Coagulation factor XIa Coagulation factor XIa light chain FA11_HUMAN Factor XIa PTA | Plasma thromboplastin antecedent
Type:
Enzyme
Mol. Mass.:
70130.58
Organism:
Homo sapiens (Human)
Description:
P03951
Residue:
625
  
Inhibitor
Name:
BDBM439354
Synonyms:
2-(4-(2-acetyl-5-chlorophenyl)-5-methoxy-2-oxopyridin-1(2H)-yl)-N-(1H-indazol-6-yl)-3-phenylpropanamide US11084808, Compound 42
Type:
Small organic molecule
Emp. Form.:
C30H25ClN4O4
Mol. Mass.:
540.997
SMILES:
COc1cn(C(Cc2ccccc2)C(=O)Nc2ccc3cn[nH]c3c2)c(=O)cc1-c1cc(Cl)ccc1C(C)=O
: