Target
Coagulation factor XI
Ligand
BDBM439393
Substrate
Meas. Tech.
Biological Assay
IC50
42.0±n/a nM
Citation
 Yang, FWang, WLi, XChen, GHe, FTao, W Oxopicolinamide derivative, preparation method therefor and pharmaceutical use thereof US Patent  US10633375 Publication Date 4/28/2020 
Target
Name:
Coagulation factor XI
Synonyms:
Coagulation factor XIa Coagulation factor XIa light chain FA11_HUMAN Factor XIa PTA | Plasma thromboplastin antecedent
Type:
Enzyme
Mol. Mass.:
70130.58
Organism:
Homo sapiens (Human)
Description:
P03951
Residue:
625
  
Inhibitor
Name:
BDBM439393
Synonyms:
(S)-4-(2-(4-(2-acetyl-5-chlorophenyl)-5-methoxy-2-oxopyridin-1(2H)-yl)-3-(3-cyanophenyl)propanamido)benzoic acid US11084808, Compound 89
Type:
Small organic molecule
Emp. Form.:
C31H24ClN3O6
Mol. Mass.:
569.992
SMILES:
COc1cn([C@@H](Cc2cccc(c2)C#N)C(=O)Nc2ccc(cc2)C(O)=O)c(=O)cc1-c1cc(Cl)ccc1C(C)=O
: