Target
Coagulation factor XI
Ligand
BDBM439427
Substrate
Meas. Tech.
Biological Assay
IC50
67.0±n/a nM
Citation
 Yang, FWang, WLi, XChen, GHe, FTao, W Oxopicolinamide derivative, preparation method therefor and pharmaceutical use thereof US Patent  US10633375 Publication Date 4/28/2020 
Target
Name:
Coagulation factor XI
Synonyms:
Coagulation factor XIa Coagulation factor XIa light chain FA11_HUMAN Factor XIa PTA | Plasma thromboplastin antecedent
Type:
Enzyme
Mol. Mass.:
70130.58
Organism:
Homo sapiens (Human)
Description:
P03951
Residue:
625
  
Inhibitor
Name:
BDBM439427
Synonyms:
4-(tert-butoxy)-2-(4-(5-chloro-2-propionylphenyl)-5-methoxy-2-oxopyridin-1(2H)-yl)-N-(quinazolin-6-yl)butanamide US11084808, Compound 121
Type:
Small organic molecule
Emp. Form.:
C31H33ClN4O5
Mol. Mass.:
577.071
SMILES:
CCC(=O)c1ccc(Cl)cc1-c1cc(=O)n(cc1OC)C(CCOC(C)(C)C)C(=O)Nc1ccc2ncncc2c1
: