Target
Bromodomain-containing protein 4 [352-457]
Ligand
BDBM439551
Substrate
Meas. Tech.
TR-FRET Assay
Ki
1.40±n/a nM
Citation
 Hasvold, LALiu, DMcDaniel, KFPratt, JSheppard, GWang, L Bromodomain inhibitors US Patent  US10633379 Publication Date 4/28/2020 
Target
Name:
Bromodomain-containing protein 4 [352-457]
Synonyms:
BRD4 Bromodomain-containing protein 4 (BRD4) Bromodomain-containing protein 4 (BRD4-BD2) | HUNK1
Type:
Enzyme Catalytic Domain
Mol. Mass.:
12432.37
Organism:
Homo sapiens (Human)
Description:
BDII: amino acid E352-M457
Residue:
106
  
Inhibitor
Name:
BDBM439551
Synonyms:
US10633379, Example 86
Type:
Small organic molecule
Emp. Form.:
C28H27F4N3O4
Mol. Mass.:
545.5253
SMILES:
CCNC(=O)c1cc2c(cn(C)c(=O)c2[nH]1)-c1cc(ccc1Oc1c(C)cc(F)cc1C)C(C)(O)C(F)(F)F
: