Target
Ataxin-2
Ligand
BDBM258484
Substrate
Meas. Tech.
Enzyme Inhibition Assay
IC50
1044±n/a nM
Citation
 Hunziker, DMattei, PMauser, HPrunotto, MUllmer, C Diazaspirocycloalkane and azaspirocycloalkane US Patent  US10633384 Publication Date 4/28/2020 
Target
Name:
Ataxin-2
Synonyms:
ATX2 ATXN2 Spinocerebellar ataxia type 2 protein Trinucleotide repeat-containing gene 13 protein
Type:
Mol. Mass.:
140337.65
Organism:
Homo sapiens (Human)
Description:
Q99700
Residue:
1313
  
Inhibitor
Name:
BDBM258484
Synonyms:
US10633384, Example 1.05 | US9493486, 1.05
Type:
Small organic molecule
Emp. Form.:
C23H25Cl2N3O3
Mol. Mass.:
462.369
SMILES:
Nc1ccc(cc1O)C(=O)N1CC2(C1)CCN(CC2)C(=O)CCc1cc(Cl)cc(Cl)c1
: