Target
Ataxin-2
Ligand
BDBM258488
Substrate
Meas. Tech.
Enzyme Inhibition Assay
IC50
50.5±n/a nM
Citation
 Hunziker, DMattei, PMauser, HPrunotto, MUllmer, C Diazaspirocycloalkane and azaspirocycloalkane US Patent  US10633384 Publication Date 4/28/2020 
Target
Name:
Ataxin-2
Synonyms:
ATX2 ATXN2 Spinocerebellar ataxia type 2 protein Trinucleotide repeat-containing gene 13 protein
Type:
Mol. Mass.:
140337.65
Organism:
Homo sapiens (Human)
Description:
Q99700
Residue:
1313
  
Inhibitor
Name:
BDBM258488
Synonyms:
US10633384, Example 1.09 | US9493486, 1.09
Type:
Small organic molecule
Emp. Form.:
C23H24ClN5O5S
Mol. Mass.:
517.985
SMILES:
CS(=O)(=O)c1cc(Cl)cc(COC(=O)N2CCC3(CN(C3)C(=O)c3ccc4[nH]nnc4c3)CC2)c1
: