Target
Ataxin-2
Ligand
BDBM258500
Substrate
Meas. Tech.
Enzyme Inhibition Assay
IC50
15.0±n/a nM
Citation
 Hunziker, DMattei, PMauser, HPrunotto, MUllmer, C Diazaspirocycloalkane and azaspirocycloalkane US Patent  US10633384 Publication Date 4/28/2020 
Target
Name:
Ataxin-2
Synonyms:
ATX2 ATXN2 Spinocerebellar ataxia type 2 protein Trinucleotide repeat-containing gene 13 protein
Type:
Mol. Mass.:
140337.65
Organism:
Homo sapiens (Human)
Description:
Q99700
Residue:
1313
  
Inhibitor
Name:
BDBM258500
Synonyms:
US10633384, Example 1.22 | US9493486, 1.22
Type:
Small organic molecule
Emp. Form.:
C23H24F3N3O6S
Mol. Mass.:
527.513
SMILES:
NS(=O)(=O)c1ccc(cc1)C(=O)N1CC2(C1)CCN(CC2)C(=O)OCc1ccc(OC(F)(F)F)cc1
: