Target
Ataxin-2
Ligand
BDBM258504
Substrate
Meas. Tech.
Enzyme Inhibition Assay
IC50
8.00±n/a nM
Citation
 Hunziker, DMattei, PMauser, HPrunotto, MUllmer, C Diazaspirocycloalkane and azaspirocycloalkane US Patent  US10633384 Publication Date 4/28/2020 
Target
Name:
Ataxin-2
Synonyms:
ATX2 ATXN2 Spinocerebellar ataxia type 2 protein Trinucleotide repeat-containing gene 13 protein
Type:
Mol. Mass.:
140337.65
Organism:
Homo sapiens (Human)
Description:
Q99700
Residue:
1313
  
Inhibitor
Name:
BDBM258504
Synonyms:
US10633384, Example 1.26 | US9493486, 1.26
Type:
Small organic molecule
Emp. Form.:
C25H28ClN5O3
Mol. Mass.:
481.975
SMILES:
CC(C)c1cc(Cl)ccc1OCC(=O)N1CCC2(CN(C2)C(=O)c2ccc3[nH]nnc3c2)CC1
: