Target
Ataxin-2
Ligand
BDBM258520
Substrate
Meas. Tech.
Enzyme Inhibition Assay
IC50
26.5±n/a nM
Citation
 Hunziker, DMattei, PMauser, HPrunotto, MUllmer, C Diazaspirocycloalkane and azaspirocycloalkane US Patent  US10633384 Publication Date 4/28/2020 
Target
Name:
Ataxin-2
Synonyms:
ATX2 ATXN2 Spinocerebellar ataxia type 2 protein Trinucleotide repeat-containing gene 13 protein
Type:
Mol. Mass.:
140337.65
Organism:
Homo sapiens (Human)
Description:
Q99700
Residue:
1313
  
Inhibitor
Name:
BDBM258520
Synonyms:
US10633384, Example 5.2 | US9493486, 5.2
Type:
Small organic molecule
Emp. Form.:
C22H19Cl2N3O5
Mol. Mass.:
476.309
SMILES:
Clc1cc(Cl)cc(COC(=O)N2CC3(CC(C3)NC(=O)c3ccc4[nH]c(=O)oc4c3)C2)c1
: