Target
Ataxin-2
Ligand
BDBM258541
Substrate
Meas. Tech.
Enzyme Inhibition Assay
IC50
622±n/a nM
Citation
 Hunziker, DMattei, PMauser, HPrunotto, MUllmer, C Diazaspirocycloalkane and azaspirocycloalkane US Patent  US10633384 Publication Date 4/28/2020 
Target
Name:
Ataxin-2
Synonyms:
ATX2 ATXN2 Spinocerebellar ataxia type 2 protein Trinucleotide repeat-containing gene 13 protein
Type:
Mol. Mass.:
140337.65
Organism:
Homo sapiens (Human)
Description:
Q99700
Residue:
1313
  
Inhibitor
Name:
BDBM258541
Synonyms:
US10633384, Example 12.03 | US9493486, 12.03
Type:
Small organic molecule
Emp. Form.:
C21H20Cl2N6O3
Mol. Mass.:
475.328
SMILES:
Clc1cc(COC(=O)N2CCC3(CN(C3)C(=O)c3ccc4[nH]nnc4c3)CC2)cnc1Cl
: