Target
Ataxin-2
Ligand
BDBM258567
Substrate
Meas. Tech.
Enzyme Inhibition Assay
IC50
68.5±n/a nM
Citation
 Hunziker, DMattei, PMauser, HPrunotto, MUllmer, C Diazaspirocycloalkane and azaspirocycloalkane US Patent  US10633384 Publication Date 4/28/2020 
Target
Name:
Ataxin-2
Synonyms:
ATX2 ATXN2 Spinocerebellar ataxia type 2 protein Trinucleotide repeat-containing gene 13 protein
Type:
Mol. Mass.:
140337.65
Organism:
Homo sapiens (Human)
Description:
Q99700
Residue:
1313
  
Inhibitor
Name:
BDBM258567
Synonyms:
US10633384, Example 12.29 | US9493486, 12.29
Type:
Small organic molecule
Emp. Form.:
C22H21Cl2N5O3
Mol. Mass.:
474.34
SMILES:
Clc1cc(Cl)cc(COC(=O)NC2CC3(C2)CC(C3)C(=O)Nc2ccc3[nH]nnc3c2)c1
: