Target
Gonadotropin-releasing hormone receptor
Ligand
BDBM405276
Substrate
Meas. Tech.
Receptor Activity Assay
IC50
0.920±n/a nM
Citation
 Lu, HSun, PGui, BDong, Q Pyrazolopyrimidone derivatives and methods of use thereof US Patent  US10633388 Publication Date 4/28/2020 
Target
Name:
Gonadotropin-releasing hormone receptor
Synonyms:
GNRHR GRHR GnRH-R Gonadotropin-releasing hormone receptor | Gonadotropin-releasing hormone receptor (GnRH)
Type:
Enzyme
Mol. Mass.:
37749.45
Organism:
Homo sapiens (Human)
Description:
P30968
Residue:
328
  
Inhibitor
Name:
BDBM405276
Synonyms:
1-(4-(1-(2,6-difluorobenzyl)-5-((dimethylamino)methyl)-3-(2-fluoro-3-methoxyphenyl)-2,4-dioxo-1,2,3,4-tetrahydropyrrolo[2,1-f][1,2,4]triazin-6-yl)phenyl)-3-ethylurea US10633388, Example 13
Type:
Small organic molecule
Emp. Form.:
C32H31F3N6O4
Mol. Mass.:
620.6215
SMILES:
CCNC(=O)Nc1ccc(cc1)-c1cn2n(Cc3c(F)cccc3F)c(=O)n(-c3cccc(OC)c3F)c(=O)c2c1CN(C)C
: