Target
Programmed cell death 1 ligand 1
Ligand
BDBM440658
Substrate
Meas. Tech.
Enzyme-Linked Immunosorbent Assay ELISA
IC50
<100±n/a nM
Citation
 Lange, CMalathong, VMcMurtrie, DJPunna, SSingh, RYang, JZhang, P Immunomodulator compounds US Patent  US10639284 Publication Date 5/5/2020 
Target
Name:
Programmed cell death 1 ligand 1
Synonyms:
B7 homolog 1 B7H1 CD274 PD-L1 PDCD1 ligand 1 PDCD1LG1 Programmed cell death 1 ligand 1 | Programmed death ligand 1
Type:
PROTEIN
Mol. Mass.:
33278.49
Organism:
Homo sapiens (Human)
Description:
ChEMBL_109807
Residue:
290
  
Inhibitor
Name:
BDBM440658
Synonyms:
US10639284, Compound 2.010 | US11426364, Compound 2.010
Type:
Small organic molecule
Emp. Form.:
C32H27ClFN3O5
Mol. Mass.:
588.025
SMILES:
OC[C@H](NCc1cc(Cl)c(O[C@H]2CCc3c2cccc3-c2cccc(F)c2)cc1OCc1cncc(c1)C#N)C(O)=O
: