Target
Retinaldehyde-binding protein 1
Ligand
BDBM323449
Substrate
Meas. Tech.
In Vitro Isomerase Inhibition Assay
IC50
55.0±n/a nM
Citation
 Scott, ILKuksa, VAOrme, MWLittle, Jr., TLGall, AHong, F Alkoxy compounds for disease treatment US Patent  US10639286 Publication Date 5/5/2020 
Target
Name:
Retinaldehyde-binding protein 1
Synonyms:
CRALBP RLBP1 | RLBP1_HUMAN
Type:
Enzyme Catalytic Domain
Mol. Mass.:
36462.25
Organism:
Homo sapiens (Human)
Description:
P12271
Residue:
317
  
Inhibitor
Name:
BDBM323449
Synonyms:
2-(3-(2-Propylpentyloxy)Phenoxy)Ethanamine US10639286, Example 25
Type:
Small organic molecule
Emp. Form.:
C16H27NO2
Mol. Mass.:
265.3911
SMILES:
CCCC(CCC)COc1cccc(OCCN)c1
: