Target
Retinaldehyde-binding protein 1
Ligand
BDBM323465
Substrate
Meas. Tech.
In Vitro Isomerase Inhibition Assay
IC50
55.0±n/a nM
Citation
 Scott, ILKuksa, VAOrme, MWLittle, Jr., TLGall, AHong, F Alkoxy compounds for disease treatment US Patent  US10639286 Publication Date 5/5/2020 
Target
Name:
Retinaldehyde-binding protein 1
Synonyms:
CRALBP RLBP1 | RLBP1_HUMAN
Type:
Enzyme Catalytic Domain
Mol. Mass.:
36462.25
Organism:
Homo sapiens (Human)
Description:
P12271
Residue:
317
  
Inhibitor
Name:
BDBM323465
Synonyms:
3-(3-(Cyclohexylmethoxy)Phenyl)Butan-1-Amine US10639286, Example 81
Type:
Small organic molecule
Emp. Form.:
C17H27NO
Mol. Mass.:
261.4024
SMILES:
CC(CCN)c1cccc(OCC2CCCCC2)c1
: