Target
Retinaldehyde-binding protein 1
Ligand
BDBM323576
Substrate
Meas. Tech.
In Vitro Isomerase Inhibition Assay
IC50
5500±n/a nM
Citation
 Scott, ILKuksa, VAOrme, MWLittle, Jr., TLGall, AHong, F Alkoxy compounds for disease treatment US Patent  US10639286 Publication Date 5/5/2020 
Target
Name:
Retinaldehyde-binding protein 1
Synonyms:
CRALBP RLBP1 | RLBP1_HUMAN
Type:
Enzyme Catalytic Domain
Mol. Mass.:
36462.25
Organism:
Homo sapiens (Human)
Description:
P12271
Residue:
317
  
Inhibitor
Name:
BDBM323576
Synonyms:
4-(3-(2-Aminoethoxy)Phenoxy)Butanamide US10639286, Example 144
Type:
Small organic molecule
Emp. Form.:
C12H18N2O3
Mol. Mass.:
238.2829
SMILES:
NCCOc1cccc(OCCCC(N)=O)c1
: