Target
Retinaldehyde-binding protein 1
Ligand
BDBM323439
Substrate
Meas. Tech.
In Vitro Isomerase Inhibition Assay
IC50
<100.0±n/a nM
Citation
 Scott, ILKuksa, VAOrme, MWLittle, Jr., TLGall, AHong, F Alkoxy compounds for disease treatment US Patent  US10639286 Publication Date 5/5/2020 
Target
Name:
Retinaldehyde-binding protein 1
Synonyms:
CRALBP RLBP1 | RLBP1_BOVIN
Type:
Protein
Mol. Mass.:
36493.29
Organism:
Bovine
Description:
P10123
Residue:
317
  
Inhibitor
Name:
BDBM323439
Synonyms:
3-(3-(2-Ethylbutoxy)Phenyl)Propan-I-Amine US10639286, Example 3
Type:
Small organic molecule
Emp. Form.:
C15H25NO
Mol. Mass.:
235.3651
SMILES:
CCC(CC)COc1cccc(CCCN)c1
: