Target
Retinaldehyde-binding protein 1
Ligand
BDBM323442
Substrate
Meas. Tech.
In Vitro Isomerase Inhibition Assay
IC50
<100.0±n/a nM
Citation
 Scott, ILKuksa, VAOrme, MWLittle, Jr., TLGall, AHong, F Alkoxy compounds for disease treatment US Patent  US10639286 Publication Date 5/5/2020 
Target
Name:
Retinaldehyde-binding protein 1
Synonyms:
CRALBP RLBP1 | RLBP1_BOVIN
Type:
Protein
Mol. Mass.:
36493.29
Organism:
Bovine
Description:
P10123
Residue:
317
  
Inhibitor
Name:
BDBM323442
Synonyms:
2-(3-(Cyclohexylmethoxy)Phenoxy)Ethanamine US10639286, Example 7
Type:
Small organic molecule
Emp. Form.:
C15H23NO2
Mol. Mass.:
249.3486
SMILES:
NCCOc1cccc(OCC2CCCCC2)c1
: