Target
Retinaldehyde-binding protein 1
Ligand
BDBM323446
Substrate
Meas. Tech.
In Vitro Isomerase Inhibition Assay
IC50
<100.0±n/a nM
Citation
 Scott, ILKuksa, VAOrme, MWLittle, Jr., TLGall, AHong, F Alkoxy compounds for disease treatment US Patent  US10639286 Publication Date 5/5/2020 
Target
Name:
Retinaldehyde-binding protein 1
Synonyms:
CRALBP RLBP1 | RLBP1_BOVIN
Type:
Protein
Mol. Mass.:
36493.29
Organism:
Bovine
Description:
P10123
Residue:
317
  
Inhibitor
Name:
BDBM323446
Synonyms:
1-((3-(3-Amino-1-Hydroxypropyl)Phenoxy)Methyl)Cyclohexanol US10639286, Example 12
Type:
Small organic molecule
Emp. Form.:
C16H25NO3
Mol. Mass.:
279.3746
SMILES:
NCCC(O)c1cccc(OCC2(O)CCCCC2)c1
: