Target
Tyrosine-protein kinase BTK
Ligand
BDBM440973
Substrate
Meas. Tech.
Inhibition TR-FRET (Time Resolved FRET) Assay
IC50
420±n/a nM
Citation
 Frattini, SBakker, RGiovannini, RFossati, GHamprecht, DLingard, IPautsch, AWellenzohn, B Heteroarylcarboxamide derivatives as plasma kallikrein inhibitors US Patent  US10640486 Publication Date 5/5/2020 
Target
Name:
Tyrosine-protein kinase BTK
Synonyms:
AGMX1 Agammaglobulinaemia tyrosine kinase B cell progenitor kinase BPK BTK_HUMAN Tyrosine Kinase BTK Tyrosine-protein kinase BTK (BTK)
Type:
Enzyme
Mol. Mass.:
76289.95
Organism:
Homo sapiens (Human)
Description:
Q06187
Residue:
659
  
Inhibitor
Name:
BDBM440973
Synonyms:
US10640486, Example 7
Type:
Small organic molecule
Emp. Form.:
C26H25F3N6O2
Mol. Mass.:
510.5109
SMILES:
Nc1ccc2[C@@H](CCc2n1)NC(=O)c1cn(Cc2ccc(CN3C[C@H]4C[C@H]4C3=O)cc2)nc1C(F)(F)F
: