Target
Tyrosine-protein kinase BTK
Ligand
BDBM441008
Substrate
Meas. Tech.
Inhibition TR-FRET (Time Resolved FRET) Assay
IC50
69.0±n/a nM
Citation
 Frattini, SBakker, RGiovannini, RFossati, GHamprecht, DLingard, IPautsch, AWellenzohn, B Heteroarylcarboxamide derivatives as plasma kallikrein inhibitors US Patent  US10640486 Publication Date 5/5/2020 
Target
Name:
Tyrosine-protein kinase BTK
Synonyms:
AGMX1 Agammaglobulinaemia tyrosine kinase B cell progenitor kinase BPK BTK_HUMAN Tyrosine Kinase BTK Tyrosine-protein kinase BTK (BTK)
Type:
Enzyme
Mol. Mass.:
76289.95
Organism:
Homo sapiens (Human)
Description:
Q06187
Residue:
659
  
Inhibitor
Name:
BDBM441008
Synonyms:
US10640486, Example 48 | US10640486, Example 49
Type:
Small organic molecule
Emp. Form.:
C24H24N6O2
Mol. Mass.:
428.4864
SMILES:
Nc1ccc2[C@@H](CCc2n1)NC(=O)c1cnn(Cc2ccc(cc2)N2CC3C[C@@H]3C2=O)c1
: