Target
Tyrosine-protein kinase BTK
Ligand
BDBM441038
Substrate
Meas. Tech.
Inhibition TR-FRET (Time Resolved FRET) Assay
IC50
4.00±n/a nM
Citation
 Frattini, SBakker, RGiovannini, RFossati, GHamprecht, DLingard, IPautsch, AWellenzohn, B Heteroarylcarboxamide derivatives as plasma kallikrein inhibitors US Patent  US10640486 Publication Date 5/5/2020 
Target
Name:
Tyrosine-protein kinase BTK
Synonyms:
AGMX1 Agammaglobulinaemia tyrosine kinase B cell progenitor kinase BPK BTK_HUMAN Tyrosine Kinase BTK Tyrosine-protein kinase BTK (BTK)
Type:
Enzyme
Mol. Mass.:
76289.95
Organism:
Homo sapiens (Human)
Description:
Q06187
Residue:
659
  
Inhibitor
Name:
BDBM441038
Synonyms:
US10640486, Example 85
Type:
Small organic molecule
Emp. Form.:
C22H24N8O
Mol. Mass.:
416.479
SMILES:
Nc1nccc2[C@@H](CCc12)NC(=O)c1cnn(Cc2cnc(cn2)N2CC3CC3C2)c1
: