Target
Tyrosine-protein kinase BTK
Ligand
BDBM317615
Substrate
Meas. Tech.
Bruton's Tyrosine Kinase (BTK) Inhibition TR-FRET (Time Resolved FRET) Assay
IC50
20.8±n/a nM
Citation
 Lopez-Tapia, FJSo, SQiao, QDominique, R Inhibitors of bruton's tyrosine kinase US Patent  US10640491 Publication Date 5/5/2020 
Target
Name:
Tyrosine-protein kinase BTK
Synonyms:
AGMX1 Agammaglobulinaemia tyrosine kinase B cell progenitor kinase BPK BTK_HUMAN Tyrosine Kinase BTK Tyrosine-protein kinase BTK (BTK)
Type:
Enzyme
Mol. Mass.:
76289.95
Organism:
Homo sapiens (Human)
Description:
Q06187
Residue:
659
  
Inhibitor
Name:
BDBM317615
Synonyms:
US10640491, Compound 4 US9624201, Compound 4 | {5-Amino-1- [4-(2,3- difluoro- phenoxy)-2- methyl- phenyl]-1H- pyrazol-4-yl}- (4-pyrazol-1- yl-1H-indol-2- yl)-methanone
Type:
Small organic molecule
Emp. Form.:
C28H20F2N6O2
Mol. Mass.:
510.4942
SMILES:
Cc1cc(Oc2cccc(F)c2F)ccc1-n1ncc(C(=O)c2cc3c(cccc3[nH]2)-n2cccn2)c1N
: