Target
High affinity nerve growth factor receptor
Ligand
BDBM441124
Substrate
Meas. Tech.
Inhibition Assay
IC50
1.10±n/a nM
Citation
 Yukimasa, ANakamura, KInagaki, MKano, KFujiu, MYamaguchi, HHata, KInoue, T Heterocycle derivatives having TrkA inhibitory activity US Patent  US10640495 Publication Date 5/5/2020 
Target
Name:
High affinity nerve growth factor receptor
Synonyms:
2.7.10.1 NTRK1 NTRK1_HUMAN Neurotrophic tyrosine kinase receptor type 1 Synonyms=MTC TRK1-transforming tyrosine kinase protein TRKA GN Tropomyosin alpha-3 chain/High affinity nerve growth factor receptor Tropomyosin-related kinase A (TrkA) Tyrosine kinase receptor (Trk) Tyrosine kinase receptor A (Trk A) Tyrosine kinase receptor A (TrkA) p140-TrkA
Type:
Mol. Mass.:
87498.18
Organism:
Homo sapiens (Human)
Description:
P04629
Residue:
796
  
Inhibitor
Name:
BDBM441124
Synonyms:
US10640495, Example I-508
Type:
Small organic molecule
Emp. Form.:
C29H31F2N7O4
Mol. Mass.:
579.5977
SMILES:
COCCN1C[C@@H](NC(=O)Nc2c(C)c(nn2-c2ccccc2)-c2cnc(COC)nc2)[C@@H](O1)c1ccc(F)c(F)c1
: