Target
High affinity nerve growth factor receptor
Ligand
BDBM441129
Substrate
Meas. Tech.
Inhibition Assay
IC50
0.930±n/a nM
Citation
 Yukimasa, ANakamura, KInagaki, MKano, KFujiu, MYamaguchi, HHata, KInoue, T Heterocycle derivatives having TrkA inhibitory activity US Patent  US10640495 Publication Date 5/5/2020 
Target
Name:
High affinity nerve growth factor receptor
Synonyms:
2.7.10.1 NTRK1 NTRK1_HUMAN Neurotrophic tyrosine kinase receptor type 1 Synonyms=MTC TRK1-transforming tyrosine kinase protein TRKA GN Tropomyosin alpha-3 chain/High affinity nerve growth factor receptor Tropomyosin-related kinase A (TrkA) Tyrosine kinase receptor (Trk) Tyrosine kinase receptor A (Trk A) Tyrosine kinase receptor A (TrkA) p140-TrkA
Type:
Mol. Mass.:
87498.18
Organism:
Homo sapiens (Human)
Description:
P04629
Residue:
796
  
Inhibitor
Name:
BDBM441129
Synonyms:
US10640495, Example I-489 | US10640495, Example I-555
Type:
Small organic molecule
Emp. Form.:
C30H34FN9O4
Mol. Mass.:
603.6473
SMILES:
COCCN1C[C@@H](NC(=O)Nc2c(C)c(nn2-c2ccccc2)-c2cnc(nc2)N2CC(C2)OC)[C@@H](O1)c1ccnc(F)c1
: