Target
Ubiquitin carboxyl-terminal hydrolase 30
Ligand
BDBM441746
Substrate
Meas. Tech.
Biochemical Assay
IC50
550±n/a nM
Citation
 Gibson, KRJones, AKemp, MIMadin, AStockley, MLWhitlock, GAWoodrow, MD Compounds US Patent  US10640498 Publication Date 5/5/2020 
Target
Name:
Ubiquitin carboxyl-terminal hydrolase 30
Synonyms:
Deubiquitinating enzyme 30 USP30 Ubiquitin carboxyl-terminal hydrolase 30 (USP30) Ubiquitin-specific-processing protease 30
Type:
Protein
Mol. Mass.:
58522.90
Organism:
Homo sapiens (Human)
Description:
Q70CQ3
Residue:
517
  
Inhibitor
Name:
BDBM441746
Synonyms:
3-Fluoro-3-(5-(6-methoxypyridin-3- yl)indoline-1-carbonyl)pyrrolidine-1- carbonitrile | US10640498, Example 43
Type:
Small organic molecule
Emp. Form.:
C20H19FN4O2
Mol. Mass.:
366.3889
SMILES:
COc1ccc(cn1)-c1ccc2N(CCc2c1)C(=O)C1(F)CCN(C1)C#N
: