Target
Ubiquitin carboxyl-terminal hydrolase 30
Ligand
BDBM441762
Substrate
Meas. Tech.
Biochemical Assay
IC50
5500±n/a nM
Citation
 Gibson, KRJones, AKemp, MIMadin, AStockley, MLWhitlock, GAWoodrow, MD Compounds US Patent  US10640498 Publication Date 5/5/2020 
Target
Name:
Ubiquitin carboxyl-terminal hydrolase 30
Synonyms:
Deubiquitinating enzyme 30 USP30 Ubiquitin carboxyl-terminal hydrolase 30 (USP30) Ubiquitin-specific-processing protease 30
Type:
Protein
Mol. Mass.:
58522.90
Organism:
Homo sapiens (Human)
Description:
Q70CQ3
Residue:
517
  
Inhibitor
Name:
BDBM441762
Synonyms:
3-(5-(1-Benzyl-1H-pyrazol-4-yl)indoline-1-carbonyl)-3-fluoropyrrolidine-1-carbonitrile | US10640498, Example 59
Type:
Small organic molecule
Emp. Form.:
C24H22FN5O
Mol. Mass.:
415.4628
SMILES:
FC1(CCN(C1)C#N)C(=O)N1CCc2cc(ccc12)-c1cnn(Cc2ccccc2)c1
: