Target
Ubiquitin carboxyl-terminal hydrolase 30
Ligand
BDBM441768
Substrate
Meas. Tech.
Biochemical Assay
IC50
550±n/a nM
Citation
 Gibson, KRJones, AKemp, MIMadin, AStockley, MLWhitlock, GAWoodrow, MD Compounds US Patent  US10640498 Publication Date 5/5/2020 
Target
Name:
Ubiquitin carboxyl-terminal hydrolase 30
Synonyms:
Deubiquitinating enzyme 30 USP30 Ubiquitin carboxyl-terminal hydrolase 30 (USP30) Ubiquitin-specific-processing protease 30
Type:
Protein
Mol. Mass.:
58522.90
Organism:
Homo sapiens (Human)
Description:
Q70CQ3
Residue:
517
  
Inhibitor
Name:
BDBM441768
Synonyms:
3-(5-(1-(3-Chlorobenzyl)-1H-pyrazol-5-yl)indoline-1-carbonyl)-3-fluoropyrrolidine-1-carbonitrile | US10640498, Example 65
Type:
Small organic molecule
Emp. Form.:
C24H21ClFN5O
Mol. Mass.:
449.908
SMILES:
FC1(CCN(C1)C#N)C(=O)N1CCc2cc(ccc12)-c1ccnn1Cc1cccc(Cl)c1
: