Target
Lysine-specific histone demethylase 1A
Ligand
BDBM104007
Substrate
Meas. Tech.
Biochemical Assay
IC50
75±n/a nM
Citation
 Wu, LKonkol, LCLajkiewicz, NLu, LXu, MYao, WYu, ZZhang, CHe, C Imidazopyridines and imidazopyrazines as LSD1 inhibitors US Patent  US10640503 Publication Date 5/5/2020 
Target
Name:
Lysine-specific histone demethylase 1A
Synonyms:
AOF2 Flavin-containing amine oxidase domain-containing protein 2 KDM1A KIAA0601 Lysine-specific demethylase 1 (LSD1) Lysine-specific histone demethylase 1 (LSD1)
Type:
Enzyme
Mol. Mass.:
92901.01
Organism:
Homo sapiens (Human)
Description:
O60341
Residue:
852
  
Inhibitor
Name:
BDBM104007
Synonyms:
US10047086, 17 US9695168, 17
Type:
Small organic molecule
Emp. Form.:
C30H31N5O2
Mol. Mass.:
493.5994
SMILES:
N#Cc1ccc(cc1)-c1cc(OC[C@@H]2CCNC2)c2cncn2c1-c1ccc(CN2CCOCC2)cc1
: