Target
Lysine-specific histone demethylase 1A
Ligand
BDBM104121
Substrate
Meas. Tech.
Biochemical Assay
IC50
300±n/a nM
Citation
 Wu, LKonkol, LCLajkiewicz, NLu, LXu, MYao, WYu, ZZhang, CHe, C Imidazopyridines and imidazopyrazines as LSD1 inhibitors US Patent  US10640503 Publication Date 5/5/2020 
Target
Name:
Lysine-specific histone demethylase 1A
Synonyms:
AOF2 Flavin-containing amine oxidase domain-containing protein 2 KDM1A KIAA0601 Lysine-specific demethylase 1 (LSD1) Lysine-specific histone demethylase 1 (LSD1)
Type:
Enzyme
Mol. Mass.:
92901.01
Organism:
Homo sapiens (Human)
Description:
O60341
Residue:
852
  
Inhibitor
Name:
BDBM104121
Synonyms:
US10047086, 39 US9695168, 39
Type:
Small organic molecule
Emp. Form.:
C29H30N8O2
Mol. Mass.:
522.6009
SMILES:
CC(O)CN1CCC[C@@H](COc2nc(-c3ccc(cc3)C#N)c(-c3cnc4n(C)ncc4c3)n3cncc23)C1
: