Target
Lysine-specific histone demethylase 1A
Ligand
BDBM105530
Substrate
Meas. Tech.
Biochemical Assay
IC50
<50±n/a nM
Citation
 Wu, LKonkol, LCLajkiewicz, NLu, LXu, MYao, WYu, ZZhang, CHe, C Imidazopyridines and imidazopyrazines as LSD1 inhibitors US Patent  US10640503 Publication Date 5/5/2020 
Target
Name:
Lysine-specific histone demethylase 1A
Synonyms:
AOF2 Flavin-containing amine oxidase domain-containing protein 2 KDM1A KIAA0601 Lysine-specific demethylase 1 (LSD1) Lysine-specific histone demethylase 1 (LSD1)
Type:
Enzyme
Mol. Mass.:
92901.01
Organism:
Homo sapiens (Human)
Description:
O60341
Residue:
852
  
Inhibitor
Name:
BDBM105530
Synonyms:
US10047086, 80 US9695168, 80
Type:
Small organic molecule
Emp. Form.:
C28H30N6O
Mol. Mass.:
466.5774
SMILES:
CN(C)c1ccc(cn1)-c1c(cc(OC[C@@H]2CCCN(C)C2)c2cncn12)-c1ccc(cc1)C#N
: