Target
Lysine-specific histone demethylase 1A
Ligand
BDBM105573
Substrate
Meas. Tech.
Biochemical Assay
IC50
<50±n/a nM
Citation
 Wu, LKonkol, LCLajkiewicz, NLu, LXu, MYao, WYu, ZZhang, CHe, C Imidazopyridines and imidazopyrazines as LSD1 inhibitors US Patent  US10640503 Publication Date 5/5/2020 
Target
Name:
Lysine-specific histone demethylase 1A
Synonyms:
AOF2 Flavin-containing amine oxidase domain-containing protein 2 KDM1A KIAA0601 Lysine-specific demethylase 1 (LSD1) Lysine-specific histone demethylase 1 (LSD1)
Type:
Enzyme
Mol. Mass.:
92901.01
Organism:
Homo sapiens (Human)
Description:
O60341
Residue:
852
  
Inhibitor
Name:
BDBM105573
Synonyms:
US10047086, 100 US9695168, 100
Type:
Small organic molecule
Emp. Form.:
C28H28N8
Mol. Mass.:
476.5755
SMILES:
CN(C)C1CCN(CC1)c1nc(-c2ccc(cc2)C#N)c(-c2ccc3n(C)ncc3c2)n2cncc12
: