Target
Chymotrypsin-like protease CTRL-1
Ligand
BDBM441779
Substrate
Meas. Tech.
Proteasome-Activity Inhibitory Assay
IC50
4.65±n/a nM
Citation
 Yang, JCen, JJFan, XM Epoxyketone compounds for enzyme inhibition US Patent  US10640533 Publication Date 5/5/2020 
Target
Name:
Chymotrypsin-like protease CTRL-1
Synonyms:
CTRL CTRL_HUMAN
Type:
PROTEIN
Mol. Mass.:
28008.18
Organism:
Homo sapiens (Human)
Description:
ChEMBL_49606
Residue:
264
  
Inhibitor
Name:
BDBM441779
Synonyms:
US10640533, Identification number CX13-133 | US10640533, Table 1.26
Type:
Small organic molecule
Emp. Form.:
C40H51N5O6
Mol. Mass.:
697.8628
SMILES:
CC(C)C[C@H](NC(=O)[C@H](Cc1ccncc1)NC(=O)[C@H](CCc1ccccc1)NC(=O)Cc1ccc(CN2CCOCC2)cc1)C(=O)[C@@]1(C)CO1
: