Target
Chymotrypsin-like protease CTRL-1
Ligand
BDBM441776
Substrate
Meas. Tech.
Proteasome-Activity Inhibitory Assay
IC50
4.74±n/a nM
Citation
 Yang, JCen, JJFan, XM Epoxyketone compounds for enzyme inhibition US Patent  US10640533 Publication Date 5/5/2020 
Target
Name:
Chymotrypsin-like protease CTRL-1
Synonyms:
CTRL CTRL_HUMAN
Type:
PROTEIN
Mol. Mass.:
28008.18
Organism:
Homo sapiens (Human)
Description:
ChEMBL_49606
Residue:
264
  
Inhibitor
Name:
BDBM441776
Synonyms:
US10640533, Identification number CX13-107 | US10640533, Table 1.23
Type:
Small organic molecule
Emp. Form.:
C34H46N4O6
Mol. Mass.:
606.7522
SMILES:
CC(C)C[C@H](NC(=O)[C@H](CCc1ccccc1)NC(=O)CN1CCOCC1)C(=O)N[C@@H](Cc1ccccc1)C(=O)[C@@]1(C)CO1
: