Target
Isocitrate dehydrogenase [NADP] cytoplasmic [R132C]
Ligand
BDBM363622
Substrate
Meas. Tech.
In Vitro Assays
IC50
<100±n/a nM
Citation
 Popovici-Muller, JLemieux, RMTravins, JCai, ZCui, DZhou, D Therapeutically active compositions and their methods of use US Patent  US10640534 Publication Date 5/5/2020 
Target
Name:
Isocitrate dehydrogenase [NADP] cytoplasmic [R132C]
Synonyms:
IDH1 IDH1(R132C) Isocitrate dehydrogenase (IDH1)(R132C) Isocitrate dehydrogenase [NADP] cytoplasmic (IDH1) (R132C) | PICD
Type:
Enzyme Catalytic Domain
Mol. Mass.:
46607.23
Organism:
Homo sapiens (Human)
Description:
O75874[R132C]
Residue:
414
  
Inhibitor
Name:
BDBM363622
Synonyms:
US10640534, Compound 111 US10717764, Compound 111 US11667673, Compound 111 | US9850277, Compound 111
Type:
Small organic molecule
Emp. Form.:
C31H27ClF3N7O5
Mol. Mass.:
670.038
SMILES:
CCOC(=O)CN1C[C@H](N(C1=O)c1nccc(n1)C#N)C(=O)N(C(C(=O)NC1CC(F)(F)C1)c1ccccc1Cl)c1cccc(F)c1
: