Target
Kappa-type opioid receptor
Ligand
BDBM168144
Substrate
Meas. Tech.
Radioligand Competition Binding Assay
pH
7.5±n/a
Temperature
298.15±n/a K
Ki
2959±n/a nM
IC50
12820±n/a nM
Comments
extracted
Citation
 Duarte, FJAnand, NKSharma, PSingh, D Opioid agonists and uses thereof US Patent  US9688638 Publication Date 6/27/2017 
Target
Name:
Kappa-type opioid receptor
Synonyms:
K-OR-1 Kappa-opioid receptor (KOR) Kappa-type opioid receptor (KOR) OPIATE Kappa OPRK1 kappa opioid receptor (KOR)
Type:
G Protein-Coupled Receptor (GPCR)
Mol. Mass.:
42648.76
Organism:
Homo sapiens (Human)
Description:
P41145
Residue:
380
  
Inhibitor
Name:
BDBM168144
Synonyms:
US10865186, Compound 4 US9688638, 5 | US9688638, 6
Type:
Small organic molecule
Emp. Form.:
C25H37NO5
Mol. Mass.:
431.565
SMILES:
COCCOCCOCCOc1ccc2C(=O)[C@@H]3[C@H](C)[C@](C)(CCN3CC3CC3)c2c1
: