Target
Phosphatidylinositol 4,5-bisphosphate 3-kinase catalytic subunit delta isoform
Ligand
BDBM261214
Substrate
Meas. Tech.
Scintillation Proximity Assay
IC50
<10±n/a nM
Citation
 Li, YYao, WCombs, APMei, SGlenn, JMaduskuie, Jr., TPSparks, RB Heterocyclylamines as PI3K inhibitors US Patent  US10646492 Publication Date 5/12/2020 
Target
Name:
Phosphatidylinositol 4,5-bisphosphate 3-kinase catalytic subunit delta isoform
Synonyms:
PI3-kinase p110 subunit delta PI3-kinase subunit p110-delta PIK3CD Phosphatidylinositol 4,5-biphosphate 3-kinase catalytic subunit delta (PIK3CD) Phosphatidylinositol 4,5-bisphosphate 3-kinase 110 kDa catalytic subunit delta (PI3K delta) Phosphatidylinositol 4,5-bisphosphate 3-kinase catalytic subunit delta (PI3Kdelta) Phosphatidylinositol 4,5-bisphosphate 3-kinase catalytic subunit delta isoform (PI3K delta) Phosphatidylinositol 4,5-bisphosphate 3-kinase catalytic subunit delta isoform (PI3K-delta) Phosphatidylinositol 4,5-bisphosphate 3-kinase catalytic subunit delta isoform (PI3Kdelta)
Type:
Enzyme Subunit
Mol. Mass.:
119489.41
Organism:
Homo sapiens (Human)
Description:
O00329
Residue:
1044
  
Inhibitor
Name:
BDBM261214
Synonyms:
4-[1-(4-Amino-3-methyl-1H-pyrazolo[3,4-d]pyrimidin-1-yl)ethyl]-6-chloro-3-ethoxy-2-[1-(2-hydroxy-1,1-dimethylethyl)azetidin-3-yl]benzonitrile US10646492, Example 237 US9707233, 237 US9932341, Example 237
Type:
Small organic molecule
Emp. Form.:
C24H30ClN7O2
Mol. Mass.:
483.994
SMILES:
CCOc1c(cc(Cl)c(C#N)c1C1CN(C1)C(C)(C)CO)C(C)n1nc(C)c2c(N)ncnc12
: