Target
Serine/threonine-protein kinase 17A
Ligand
BDBM441873
Substrate
Meas. Tech.
Activity Inhibition Assay
IC50
16.0±n/a nM
Citation
 Lee, KChoi, GLee, NRPark, SJJung, MEKim, SJYang, KLee, J Substituted pyrimidines for preventing or treating cancer and inflammatory diseases US Patent  US10647686 Publication Date 5/12/2020 
Target
Name:
Serine/threonine-protein kinase 17A
Synonyms:
DRAK1 STK17A
Type:
Enzyme Catalytic Domain
Mol. Mass.:
46544.04
Organism:
Homo sapiens (Human)
Description:
gi_109255245
Residue:
414
  
Inhibitor
Name:
BDBM441873
Synonyms:
US10647686, Example (20)
Type:
Small organic molecule
Emp. Form.:
C14H16ClN5O2
Mol. Mass.:
321.762
SMILES:
NCCCNc1nc(Nc2ccc3OCOc3c2)ncc1Cl
: