Target
ALK tyrosine kinase receptor
Ligand
BDBM441911
Substrate
Meas. Tech.
Inhibitory Activity Assay
IC50
5.5±n/a nM
Citation
 Hong, JLiu, GWang, JLe, X Diphenylaminopyrimidine and triazine compound, and pharmaceutical composition and use thereof US Patent  US10647694 Publication Date 5/12/2020 
Target
Name:
ALK tyrosine kinase receptor
Synonyms:
ALK ALK_HUMAN CD_antigen: CD246
Type:
Protein
Mol. Mass.:
176453.10
Organism:
Homo sapiens (Human)
Description:
Q9UM73
Residue:
1620
  
Inhibitor
Name:
BDBM441911
Synonyms:
US10647694, Example 2
Type:
Small organic molecule
Emp. Form.:
C26H32FN5O3S
Mol. Mass.:
513.627
SMILES:
COc1cc(C2CCNCC2)c(C)cc1Nc1ncc(F)c(Nc2ccccc2S(=O)(=O)C(C)C)n1
: